Flower [ 2 ]
type: Class
comment: reproductive organ of angiosperm plants especially one having showy or colorful parts
description: reproductive organ of angiosperm plants especially one having showy or colorful parts
subclass of: Reproductive structure

Floret
type: Class
subclass of: Flower [ 2 ]
comment: a diminutive flower (especially one that is part of a composite flower)
description: a diminutive flower (especially one that is part of a composite flower)

Apetalous_flower
type: Class
subclass of: Flower [ 2 ]
comment: flower having no petals
description: flower having no petals

Inflorescence
type: Class
subclass of: Flower [ 2 ]
comment: the flowering part of a plant or arrangement of flowers on a stalk
description: the flowering part of a plant or arrangement of flowers on a stalk

Ray_flower
type: Class
subclass of: Flower [ 2 ]
comment: small flower with a flat strap-shaped corolla usually occupying the peripheral rings of a composite flower
description: small flower with a flat strap-shaped corolla usually occupying the peripheral rings of a composite flower

Ray_floret
type: Class
subclass of: Flower [ 2 ]
comment: small flower with a flat strap-shaped corolla usually occupying the peripheral rings of a composite flower
description: small flower with a flat strap-shaped corolla usually occupying the peripheral rings of a composite flower

Bud
type: Class
subclass of: Flower [ 2 ]
comment: a partially opened flower
description: a partially opened flower

Chrysanthemum
type: Class
subclass of: Flower [ 2 ]
comment: the flower of a chrysanthemum plant
description: the flower of a chrysanthemum plant